Reaction Details
TargetCoagulation factor XI
LigandBDBM345062
Substrate/Competitorn/a
Meas. Tech.Factor XIa Assay
IC50 14.2±n/a nM
Citation Liu, WEdmondson, SDGuo, ZMertz, EOgawa, AKSo, SSun, WBrockunier, LLAli, AKuang, RWu, H Factor Xla inhibitors US Patent US9783530 Publication Date 10/10/2017
 
Coagulation factor XI
Name:Coagulation factor XI
Type:Enzyme
Mol. Mass.:70130.58
Organism:Homo sapiens (Human)
Description:P03951
Residue:625
BDBM345062
NameBDBM345062
Synonyms:4-{[(2S)-2-{5-[5-chloro- 2-(1H-tetrazol-1- yl)phenyl]-1- oxidopyridin-2-yl}-3-(4- fluorophenyl)propanoyl] amino}benzoic acid | US9783530, 7
TypeSmall organic molecule
Emp. Form.C28H20ClFN6O4
Mol. Mass.558.948
SMILESOC(=O)c1ccc(NC(=O)[C@@H](Cc2ccc(F)cc2)c2ccc(c[n+]2[O-])-c2cc(Cl)ccc2-n2cnnn2)cc1