Reaction Details
TargetKallikrein-1
LigandBDBM345062
Substrate/Competitorn/a
Meas. Tech.Kallikrein Assay
IC50 67.1±n/a nM
Citation Liu, WEdmondson, SDGuo, ZMertz, EOgawa, AKSo, SSun, WBrockunier, LLAli, AKuang, RWu, H Factor Xla inhibitors US Patent US9783530 Publication Date 10/10/2017
 
Kallikrein-1
Name:Kallikrein-1
Type:Enzyme
Mol. Mass.:28874.69
Organism:Homo sapiens (Human)
Description:P06870
Residue:262
BDBM345062
NameBDBM345062
Synonyms:4-{[(2S)-2-{5-[5-chloro- 2-(1H-tetrazol-1- yl)phenyl]-1- oxidopyridin-2-yl}-3-(4- fluorophenyl)propanoyl] amino}benzoic acid | US9783530, 7
TypeSmall organic molecule
Emp. Form.C28H20ClFN6O4
Mol. Mass.558.948
SMILESOC(=O)c1ccc(NC(=O)[C@@H](Cc2ccc(F)cc2)c2ccc(c[n+]2[O-])-c2cc(Cl)ccc2-n2cnnn2)cc1