Reaction Details
TargetKallikrein-1
LigandBDBM345064
Substrate/Competitorn/a
Meas. Tech.Kallikrein Assay
IC50 1573±n/a nM
Citation Liu, WEdmondson, SDGuo, ZMertz, EOgawa, AKSo, SSun, WBrockunier, LLAli, AKuang, RWu, H Factor Xla inhibitors US Patent US9783530 Publication Date 10/10/2017
 
Kallikrein-1
Name:Kallikrein-1
Type:Enzyme
Mol. Mass.:28874.69
Organism:Homo sapiens (Human)
Description:P06870
Residue:262
BDBM345064
NameBDBM345064
Synonyms:4-({[5-(3-chloro-2,6- difluorophenyl)-1- oxidopyridin-2- yl]acetyl}amino) benzoic acid | US9783530, 9
TypeSmall organic molecule
Emp. Form.C20H13ClF2N2O4
Mol. Mass.418.778
SMILESOC(=O)c1ccc(NC(=O)Cc2ccc(c[n+]2[O-])-c2c(F)ccc(Cl)c2F)cc1