Reaction Details
TargetMetallo-beta-lactamase type 2
LigandBDBM360919
Substrate/Competitorn/a
Meas. Tech.BIOLOGICAL ASSAYS
IC50 0.021±n/a nM
Citation Bennett, FJiang, JPasternak, ADong, SGu, XScott, JDTang, HZhao, ZHuang, YYang, DYoung, KXiao, LZhang, ZFu, J Metallo-beta-lactamase inhibitors US Patent US10221163 Publication Date 3/5/2019
 
Metallo-beta-lactamase type 2
Name:Metallo-beta-lactamase type 2
Type:PROTEIN
Mol. Mass.:28498.15
Organism:Klebsiella pneumoniae
Description:ChEMBL_103887
Residue:270
BDBM360919
NameBDBM360919
Synonyms:(S)-tert-butyl (3-(2-(N,N-bis(4- methoxybenzyl)sulfamoyl)-4- iodo-3-(2-(4-methoxybenzyl)- 2H-tetrazol-5- yl)phenylsulfonamido)-2- hydroxypropyl)carbamate US10544130, Example 75
TypeSmall organic molecule
Emp. Form.C39H46IN7O10S2
Mol. Mass.963.858
SMILESCOc1ccc(CN(Cc2ccc(OC)cc2)S(=O)(=O)c2c(ccc(I)c2-c2nnn(Cc3ccc(OC)cc3)n2)S(=O)(=O)NC[C@@H](O)CNC(=O)OC(C)(C)C)cc1