Reaction Details
TargetMetallo-beta-lactamase type 2
LigandBDBM361091
Substrate/Competitorn/a
Meas. Tech.BIOLOGICAL ASSAYS
IC50 0.011±n/a nM
Citation Bennett, FJiang, JPasternak, ADong, SGu, XScott, JDTang, HZhao, ZHuang, YYang, DYoung, KXiao, LZhang, ZFu, J Metallo-beta-lactamase inhibitors US Patent US10221163 Publication Date 3/5/2019
 
Metallo-beta-lactamase type 2
Name:Metallo-beta-lactamase type 2
Type:PROTEIN
Mol. Mass.:28498.15
Organism:Klebsiella pneumoniae
Description:ChEMBL_103887
Residue:270
BDBM361091
NameBDBM361091
Synonyms:(3R)-3-{[4-(2-amino-1H-1,3-benzodiazol-4-yl)-2-sulfamoyl-3-(2H-1,2,3,4-tetrazol-5-yl)benzene]sulfonamido}-1-(2-aminoethyl)-1-methylpyrrolidin-1-ium; methaneperoxoate US10544130, Example 249
TypeSmall organic molecule
Emp. Form.C21H28N11O4S2
Mol. Mass.562.648
SMILESC[N]1(CCN)CC[C@@H](C1)NS(=O)(=O)c1ccc(-c2cccc3[nH]c(N)nc23)c(-c2nn[nH]n2)c1S(N)(=O)=O