Reaction Details
TargetTransient receptor potential cation channel subfamily V member 1
LigandBDBM20488
Substrate/CompetitorBDBM10852
Meas. Tech.FLIPR (Fluorescence Imaging Plate Reader)-Based Ca2+ Assay
pH7.2±n/a
Temperature298.15±n/a K
EC50 20±n/a nM
Citation Rami, HKThompson, MWyman, PJerman, JCEgerton, JBrough, SStevens, AJRandall, ADSmart, DGunthorpe, MJDavis, JB Discovery of small molecule antagonists of TRPV1. Bioorg Med Chem Lett14:3631-4 (2004) 
 
Transient receptor potential cation channel subfamily V member 1
Name:Transient receptor potential cation channel subfamily V member 1
Type:Protein
Mol. Mass.:94960.75
Organism:Homo sapiens (Human)
Description:Q8NER1
Residue:839
BDBM20488
BDBM10852
NameBDBM20488
Synonyms:(2E)-3-(4-chlorophenyl)-N-(3-methoxyphenyl)prop-2-enamide | SB-366791
TypeSmall organic molecule
Emp. Form.C16H14ClNO2
Mol. Mass.287.741
SMILESCOc1cccc(NC(=O)\C=C\c2ccc(Cl)cc2)c1