Reaction Details
TargetHeat shock protein HSP 90-beta
LigandBDBM20891
Substrate/CompetitorBDBM15527
Meas. Tech.Fluorescence Polarization (FP) Assay and Cell Growth Inhibition (SRB) Assay
pH7.4±n/a
Temperature295.15±n/a K
IC50 1000±n/a nM
EC50 25140±n/a nM
Citation Brough, PAAherne, WBarril, XBorgognoni, JBoxall, KCansfield, JECheung, KMCollins, IDavies, NGDrysdale, MJDymock, BEccles, SAFinch, HFink, AHayes, AHowes, RHubbard, REJames, KJordan, AMLockie, AMartins, VMassey, AMatthews, TPMcDonald, ENorthfield, CJPearl, LHProdromou, CRay, SRaynaud, FIRoughley, SDSharp, SYSurgenor, AWalmsley, DLWebb, PWood, MWorkman, PWright, L 4,5-diarylisoxazole Hsp90 chaperone inhibitors: potential therapeutic agents for the treatment of cancer. J Med Chem51:196-218 (2008) 
 
Heat shock protein HSP 90-beta
Name:Heat shock protein HSP 90-beta
Type:Molecular Chaperone
Mol. Mass.:83229.45
Organism:Homo sapiens (Human)
Description:P08238
Residue:724
BDBM20891
BDBM15527
NameBDBM20891
Synonyms:3-(5-chloro-2,4-dihydroxyphenyl)-N-ethyl-4-[3-({[2-(piperidin-1-yl)ethyl]amino}methyl)phenyl]-1H-pyrazole-5-carboxamide | Pyrazole, 20b
TypeSmall organic molecule
Emp. Form.C26H32ClN5O3
Mol. Mass.498.017
SMILESCCNC(=O)c1[nH]nc(c1-c1cccc(CNCCN2CCCCC2)c1)-c1cc(Cl)c(O)cc1O