Reaction Details
TargetHeat shock protein HSP 90-beta
LigandBDBM20908
Substrate/CompetitorBDBM15527
Meas. Tech.Fluorescence Polarization (FP) Assay and Cell Growth Inhibition (SRB) Assay
IC50 18±n/a nM
EC50 69±n/a nM
Citation Brough, PAAherne, WBarril, XBorgognoni, JBoxall, KCansfield, JECheung, KMCollins, IDavies, NGDrysdale, MJDymock, BEccles, SAFinch, HFink, AHayes, AHowes, RHubbard, REJames, KJordan, AMLockie, AMartins, VMassey, AMatthews, TPMcDonald, ENorthfield, CJPearl, LHProdromou, CRay, SRaynaud, FIRoughley, SDSharp, SYSurgenor, AWalmsley, DLWebb, PWood, MWorkman, PWright, L 4,5-diarylisoxazole Hsp90 chaperone inhibitors: potential therapeutic agents for the treatment of cancer. J Med Chem51:196-218 (2008) 
 
Heat shock protein HSP 90-beta
Name:Heat shock protein HSP 90-beta
Type:Molecular Chaperone
Mol. Mass.:83229.45
Organism:Homo sapiens (Human)
Description:P08238
Residue:724
BDBM20908
BDBM15527
NameBDBM20908
Synonyms:5-(5-chloro-2,4-dihydroxyphenyl)-4-{4-[(dimethylamino)methyl]phenyl}-N-ethyl-1,2-oxazole-3-carboxamide US10413550, Example 59 US9718793, 59
TypeSmall organic molecule
Emp. Form.C21H22ClN3O4
Mol. Mass.415.87
SMILESCCNC(=O)c1noc(c1-c1ccc(CN(C)C)cc1)-c1cc(Cl)c(O)cc1O