Reaction Details
TargetHeat shock protein HSP 90-beta
LigandBDBM20927
Substrate/CompetitorBDBM15527
Meas. Tech.Fluorescence Polarization (FP) Assay and Cell Growth Inhibition (SRB) Assay
IC50 6±n/a nM
EC50 6±n/a nM
Citation Brough, PAAherne, WBarril, XBorgognoni, JBoxall, KCansfield, JECheung, KMCollins, IDavies, NGDrysdale, MJDymock, BEccles, SAFinch, HFink, AHayes, AHowes, RHubbard, REJames, KJordan, AMLockie, AMartins, VMassey, AMatthews, TPMcDonald, ENorthfield, CJPearl, LHProdromou, CRay, SRaynaud, FIRoughley, SDSharp, SYSurgenor, AWalmsley, DLWebb, PWood, MWorkman, PWright, L 4,5-diarylisoxazole Hsp90 chaperone inhibitors: potential therapeutic agents for the treatment of cancer. J Med Chem51:196-218 (2008) 
 
Heat shock protein HSP 90-beta
Name:Heat shock protein HSP 90-beta
Type:Molecular Chaperone
Mol. Mass.:83229.45
Organism:Homo sapiens (Human)
Description:P08238
Residue:724
BDBM20927
BDBM15527
NameBDBM20927
Synonyms:4-{4-[(diethylamino)methyl]phenyl}-5-[2,4-dihydroxy-5-(propan-2-yl)phenyl]-N-ethyl-1,2-oxazole-3-carboxamide US10413550, Example 78b US9718793, 78b
TypeSmall organic molecule
Emp. Form.C26H33N3O4
Mol. Mass.451.5579
SMILESCCNC(=O)c1noc(c1-c1ccc(CN(CC)CC)cc1)-c1cc(C(C)C)c(O)cc1O