Reaction Details
TargetProcathepsin L
LigandBDBM20999
Substrate/CompetitorBDBM20994
Meas. Tech.Enzyme Inhibition Assay
pH5.5±n/a
Temperature298.15±n/a K
Ki 24±n/a nM
Citation Chowdhury, SFJoseph, LKumar, STulsidas, SRBhat, SZiomek, EMénard, RSivaraman, JPurisima, EO Exploring inhibitor binding at the s' subsites of cathepsin L. J Med Chem51:1361-8 (2008) 
 
Procathepsin L
Name:Procathepsin L
Type:Enzyme
Mol. Mass.:37557.19
Organism:Homo sapiens (Human)
Description:Purchased from Calbiochem (San Diego, CA).
Residue:333
BDBM20999
BDBM20994
NameBDBM20999
Synonyms:(2R)-2-[(2R)-3-(benzylsulfanyl)-2-[1-(4-phenylphenyl)acetamido]propanamido]-5-[(diaminomethylidene)amino]-N-[(1S)-2-phenyl-1-[(2-phenylethyl)carbamoyl]ethyl]pentanamide | Tripeptide derivative, 7
TypeSmall organic molecule
Emp. Form.C47H53N7O4S
Mol. Mass.812.033
SMILES[#7]\[#6](-[#7])=[#7]/[#6]-[#6]-[#6]-[#6@@H](-[#7]-[#6](=O)-[#6@H](-[#6]-[#16]-[#6]-c1ccccc1)-[#7]-[#6](=O)-[#6]-c1ccc(cc1)-c1ccccc1)-[#6](=O)-[#7]-[#6@@H](-[#6]-c1ccccc1)-[#6](=O)-[#7]-[#6]-[#6]-c1ccccc1