Reaction Details
TargetProcathepsin L
LigandBDBM21003
Substrate/CompetitorBDBM20994
Meas. Tech.Enzyme Inhibition Assay
pH5.5±n/a
Temperature298.15±n/a K
Ki 10700±n/a nM
Citation Chowdhury, SFJoseph, LKumar, STulsidas, SRBhat, SZiomek, EMénard, RSivaraman, JPurisima, EO Exploring inhibitor binding at the s' subsites of cathepsin L. J Med Chem51:1361-8 (2008) 
 
Procathepsin L
Name:Procathepsin L
Type:Enzyme
Mol. Mass.:37557.19
Organism:Homo sapiens (Human)
Description:Purchased from Calbiochem (San Diego, CA).
Residue:333
BDBM21003
BDBM20994
NameBDBM21003
Synonyms:(2R)-5-[(diaminomethylidene)amino]-2-[(2S)-2-formamido-2-[1-(4-phenylphenyl)acetamido]ethan-1-aminium]-N-[(1S)-2-(4-hydroxyphenyl)-1-[(2-phenylethyl)carbamoyl]ethyl]pentanamide | Tripeptide derivative, 11
TypeSmall organic molecule
Emp. Form.C40H49N8O5
Mol. Mass.721.8671
SMILES[#7]\[#6](-[#7])=[#7]/[#6]-[#6]-[#6]-[#6@@H](-[#7]-[#6](=O)-[#6@H](-[#6]-[#7+])-[#7]-[#6](=O)-[#6]-c1ccc(cc1)-c1ccccc1)-[#6](=O)-[#7]-[#6@@H](-[#6]-c1ccc(-[#8])cc1)-[#6](=O)-[#7]-[#6]-[#6]-c1ccccc1