Reaction Details
TargetMetallo-beta-lactamase type 2
LigandBDBM367846
Substrate/Competitorn/a
Meas. Tech.Enzyme Activity
IC50 0.024±n/a nM
Citation Bennett, FJiang, JPasternak, ADong, SGu, XScott, JDTang, HZhao, ZHuang, YHunter, DYang, DYoung, KXiao, LZhang, ZFu, JBai, YZheng, ZZhang, X Metallo-beta-lactamase inhibitors US Patent US10227331 Publication Date 3/12/2019
 
Metallo-beta-lactamase type 2
Name:Metallo-beta-lactamase type 2
Type:PROTEIN
Mol. Mass.:28498.15
Organism:Klebsiella pneumoniae
Description:ChEMBL_103887
Residue:270
BDBM367846
NameBDBM367846
Synonyms:3-(2-amino-4- methylbenzo[d]thiazol-7- yl)-6-(azetidin-3- ylsulfonyl)-2-(2H-tetrazol- 5-yl)benzenesulfonamide | US10227331, Example 33
TypeSmall organic molecule
Emp. Form.C18H18N8O4S3
Mol. Mass.506.582
SMILESCc1ccc(-c2ccc(c(c2-c2nn[nH]n2)S(N)(=O)=O)S(=O)(=O)C2CNC2)c2sc(N)nc12