Reaction Details
TargetEpidermal growth factor receptor
LigandBDBM50029668
Substrate/Competitorn/a
Meas. Tech.ASV & NPG EGFR Exon 20 Insertion Mutations
IC50 300±n/a nM
Citation Huang, WGong, YLi, FBencivenga, NEDalgarno, DCKohlmann, AShakespeare, WCThomas, RMZhu, XWest, AYoungsaye, WZhang, YZhou, T Heteroaryl compounds for kinase inhibition US Patent US10227342 Publication Date 3/12/2019
 
Epidermal growth factor receptor
Name:Epidermal growth factor receptor
Type:Receptor Kinase Domain
Mol. Mass.:134279.59
Organism:Homo sapiens (Human)
Description:P00533
Residue:1210
BDBM50029668
NameBDBM50029668
Synonyms:AZD-9291 US10085983, Compound AZD-9291 US11111233, Example AZD9291 US20230322822, Compound AZD9291 WO2022090481, Example osimertinib
TypeSmall organic molecule
Emp. Form.C28H33N7O2
Mol. Mass.499.6073
SMILESCOc1cc(N(C)CCN(C)C)c(NC(=O)C=C)cc1Nc1nccc(n1)-c1cn(C)c2ccccc12