Reaction Details
TargetNuclear receptor ROR-gamma
LigandBDBM189905
Substrate/Competitorn/a
Meas. Tech.Assay of Co-Activator Recruitment by TR-FRET
IC50 2.80±n/a nM
Citation Schnute, MEFlick, ACJones, PKaila, NMente, SRTrzupek, JDVazquez, MLWennerstal, GMXing, LZamaratski, EZhang, LUnwalla, RJ Methyl- and trifluoromethyl-substituted pyrrolopyridine modulators of RORC2 and methods of use therof US Patent US10227346 Publication Date 3/12/2019
 
Nuclear receptor ROR-gamma
Name:Nuclear receptor ROR-gamma
Type:Enzyme Catalytic Domain
Mol. Mass.:58218.40
Organism:Homo sapiens (Human)
Description:P51449
Residue:518
BDBM189905
NameBDBM189905
Synonyms:US10227346, Example 30 US9670201, 30 (R)-3-cyano-4-methoxy-N-(1-methyl-4-(trifluoromethyl)-3-(1-(2,3,3-trimethylbutanoyl)piperidin-4-yl)-1H-pyrrolo[2,3-b]pyridin-5-yl)benzamide | US9920054, Example 30
TypeSmall organic molecule
Emp. Form.C30H34F3N5O3
Mol. Mass.569.6179
SMILESCOc1ccc(cc1C#N)C(=O)Nc1cnc2n(C)cc(C3CCN(CC3)C(=O)[C@H](C)C(C)(C)C)c2c1C(F)(F)F