Reaction Details
TargetL-lactate dehydrogenase
LigandBDBM23237
Substrate/CompetitorBDBM23233
Meas. Tech.Lactate Dehydrogenase Inhibition Assay
pH7.5±n/a
Temperature298.15±n/a K
IC50>200000±n/a nM
Citation Cameron, ARead, JTranter, RWinter, VJSessions, RBBrady, RLVivas, LEaston, AKendrick, HCroft, SLBarros, DLavandera, JLMartin, JJRisco, FGarcía-Ochoa, SGamo, FJSanz, LLeon, LRuiz, JRGabarró, RMallo, AGómez de las Heras, F Identification and activity of a series of azole-based compounds with lactate dehydrogenase-directed anti-malarial activity. J Biol Chem279:31429-39 (2004) 
 
L-lactate dehydrogenase
Name:L-lactate dehydrogenase
Type:Oxidoreductase
Mol. Mass.:34111.90
Organism:Plasmodium falciparum
Description:n/a
Residue:316
BDBM23237
BDBM23233
NameBDBM23237
Synonyms:1,2,5-oxadiazole, OXD5 | 2-(4-hydroxy-1,2,5-oxadiazol-3-yl)acetic acid
TypeSmall organic molecule
Emp. Form.C4H4N2O4
Mol. Mass.144.0856
SMILESOC(=O)Cc1no[nH]c1=O