Reaction Details
TargetL-lactate dehydrogenase
LigandBDBM23245
Substrate/CompetitorBDBM23233
Meas. Tech.Lactate Dehydrogenase Inhibition Assay
pH7.5±n/a
Temperature298.15±n/a K
IC50>100000±n/a nM
Citation Cameron, ARead, JTranter, RWinter, VJSessions, RBBrady, RLVivas, LEaston, AKendrick, HCroft, SLBarros, DLavandera, JLMartin, JJRisco, FGarcía-Ochoa, SGamo, FJSanz, LLeon, LRuiz, JRGabarró, RMallo, AGómez de las Heras, F Identification and activity of a series of azole-based compounds with lactate dehydrogenase-directed anti-malarial activity. J Biol Chem279:31429-39 (2004) 
 
L-lactate dehydrogenase
Name:L-lactate dehydrogenase
Type:Oxidoreductase
Mol. Mass.:34111.90
Organism:Plasmodium falciparum
Description:n/a
Residue:316
BDBM23245
BDBM23233
NameBDBM23245
Synonyms:1,2(1,5)-Isoxazole, IOA4 | 2-methyl-3-oxo-2,3-dihydro-1,2-oxazole-4-carboxylic acid
TypeSmall organic molecule
Emp. Form.C5H5NO4
Mol. Mass.143.0975
SMILESCn1occ(C(O)=O)c1=O