Reaction Details
TargetL-lactate dehydrogenase
LigandBDBM23254
Substrate/CompetitorBDBM23233
Meas. Tech.Lactate Dehydrogenase Inhibition Assay
pH7.5±n/a
Temperature298.15±n/a K
IC50>100000±n/a nM
Citation Cameron, ARead, JTranter, RWinter, VJSessions, RBBrady, RLVivas, LEaston, AKendrick, HCroft, SLBarros, DLavandera, JLMartin, JJRisco, FGarcía-Ochoa, SGamo, FJSanz, LLeon, LRuiz, JRGabarró, RMallo, AGómez de las Heras, F Identification and activity of a series of azole-based compounds with lactate dehydrogenase-directed anti-malarial activity. J Biol Chem279:31429-39 (2004) 
 
L-lactate dehydrogenase
Name:L-lactate dehydrogenase
Type:Oxidoreductase
Mol. Mass.:34111.90
Organism:Plasmodium falciparum
Description:n/a
Residue:316
BDBM23254
BDBM23233
NameBDBM23254
Synonyms:4-hydroxy-1-methyl-1H-1,2,3-triazole-5-carboxylic acid | Triazole, TRZ1
TypeSmall organic molecule
Emp. Form.C4H5N3O3
Mol. Mass.143.1008
SMILESCn1nnc(O)c1C(O)=O