Reaction Details
TargetHydroxycarboxylic acid receptor 2
LigandBDBM23524
Substrate/CompetitorBDBM23515
Meas. Tech.Tritiated Niacin Binding Assay and [35S]-GTP-gammaS Binding Assay
pH7.4±n/a
Temperature296.15±n/a K
IC50 8±n/a nM
EC50 77±n/a nM
Citation Shen, HCDing, FXLuell, SForrest, MJCarballo-Jane, EWu, KKWu, TJCheng, KWilsie, LCKrsmanovic, MLTaggart, AKRen, NCai, TQDeng, QChen, QWang, JWolff, MSTong, XHolt, TGWaters, MGHammond, MLTata, JRColletti, SL Discovery of biaryl anthranilides as full agonists for the high affinity niacin receptor. J Med Chem50:6303-6 (2007) 
 
Hydroxycarboxylic acid receptor 2
Name:Hydroxycarboxylic acid receptor 2
Type:G Protein-Coupled Receptor (GPCR)
Mol. Mass.:41868.22
Organism:Homo sapiens (Human)
Description:Membranes from CHO cells expressing the recombinant human GPR109A were used in competition binding assay.
Residue:363
BDBM23524
BDBM23515
NameBDBM23524
Synonyms:2-{3-[5-(2-chloro-4-hydroxyphenyl)thiophen-2-yl]propanamido}benzoic acid | Biaryl Anthranilide Analogue, 2f
TypeSmall organic molecule
Emp. Form.C20H16ClNO4S
Mol. Mass.401.863
SMILESOC(=O)c1ccccc1NC(=O)CCc1ccc(s1)-c1ccc(O)cc1Cl