Reaction Details
TargetHydroxycarboxylic acid receptor 2
LigandBDBM23525
Substrate/CompetitorBDBM23515
Meas. Tech.Tritiated Niacin Binding Assay and [35S]-GTP-gammaS Binding Assay
pH7.4±n/a
Temperature296.15±n/a K
IC50 1±n/a nM
EC50 6±n/a nM
Citation Shen, HCDing, FXLuell, SForrest, MJCarballo-Jane, EWu, KKWu, TJCheng, KWilsie, LCKrsmanovic, MLTaggart, AKRen, NCai, TQDeng, QChen, QWang, JWolff, MSTong, XHolt, TGWaters, MGHammond, MLTata, JRColletti, SL Discovery of biaryl anthranilides as full agonists for the high affinity niacin receptor. J Med Chem50:6303-6 (2007) 
 
Hydroxycarboxylic acid receptor 2
Name:Hydroxycarboxylic acid receptor 2
Type:G Protein-Coupled Receptor (GPCR)
Mol. Mass.:41868.22
Organism:Homo sapiens (Human)
Description:Membranes from CHO cells expressing the recombinant human GPR109A were used in competition binding assay.
Residue:363
BDBM23525
BDBM23515
NameBDBM23525
Synonyms:2-{3-[2-(2-chloro-4-hydroxyphenyl)-1,3-thiazol-5-yl]propanamido}benzoic acid | Biaryl Anthranilide Analogue, 2g
TypeSmall organic molecule
Emp. Form.C19H15ClN2O4S
Mol. Mass.402.851
SMILESOC(=O)c1ccccc1NC(=O)CCc1cnc(s1)-c1ccc(O)cc1Cl