Reaction Details
TargetHydroxycarboxylic acid receptor 2
LigandBDBM23527
Substrate/CompetitorBDBM23515
Meas. Tech.Tritiated Niacin Binding Assay and [35S]-GTP-gammaS Binding Assay
pH7.4±n/a
Temperature296.15±n/a K
IC50 10±n/a nM
EC50 120±n/a nM
Citation Shen, HCDing, FXLuell, SForrest, MJCarballo-Jane, EWu, KKWu, TJCheng, KWilsie, LCKrsmanovic, MLTaggart, AKRen, NCai, TQDeng, QChen, QWang, JWolff, MSTong, XHolt, TGWaters, MGHammond, MLTata, JRColletti, SL Discovery of biaryl anthranilides as full agonists for the high affinity niacin receptor. J Med Chem50:6303-6 (2007) 
 
Hydroxycarboxylic acid receptor 2
Name:Hydroxycarboxylic acid receptor 2
Type:G Protein-Coupled Receptor (GPCR)
Mol. Mass.:41868.22
Organism:Homo sapiens (Human)
Description:Membranes from CHO cells expressing the recombinant human GPR109A were used in competition binding assay.
Residue:363
BDBM23527
BDBM23515
NameBDBM23527
Synonyms:2-{3-[3-(4-hydroxyphenyl)-1,2,4-oxadiazol-5-yl]propanamido}benzoic acid | Biaryl Anthranilide Analogue, 2i
TypeSmall organic molecule
Emp. Form.C18H15N3O5
Mol. Mass.353.3288
SMILESOC(=O)c1ccccc1NC(=O)CCc1nc(no1)-c1ccc(O)cc1