Reaction Details
TargetTyrosine-protein kinase BTK
LigandBDBM377775
Substrate/Competitorn/a
Meas. Tech.Human BTK LanthaScreen Assay
IC50 0.600±n/a nM
Citation Springer, JRDevadas, BGarland, DJGrapperhaus, MLHan, SHockerman, SLHughes, ROSaiah, ESchnute, MESelness, SRWalker, DPWan, ZXing, LZapf, CWSchmidt, MA Bruton's tyrosine kinase inhibitors US Patent US10266513 Publication Date 4/23/2019
 
Tyrosine-protein kinase BTK
Name:Tyrosine-protein kinase BTK
Type:Enzyme
Mol. Mass.:76289.95
Organism:Homo sapiens (Human)
Description:Q06187
Residue:659
BDBM377775
NameBDBM377775
Synonyms:(R)-5-amino-1-(1-cyanopiperidin-3-yl)-3-(4-(3-methylbenzyl)phenyl)-1H-pyrazole-4-carboxamide US10815213, Example 69
TypeSmall organic molecule
Emp. Form.C24H26N6O
Mol. Mass.414.5028
SMILESCc1cccc(Cc2ccc(cc2)-c2nn([C@@H]3CCCN(C3)C#N)c(N)c2C(N)=O)c1