Reaction Details
TargetTyrosine-protein kinase BTK
LigandBDBM377780
Substrate/Competitorn/a
Meas. Tech.Human BTK LanthaScreen Assay
IC50 1.000±n/a nM
Citation Springer, JRDevadas, BGarland, DJGrapperhaus, MLHan, SHockerman, SLHughes, ROSaiah, ESchnute, MESelness, SRWalker, DPWan, ZXing, LZapf, CWSchmidt, MA Bruton's tyrosine kinase inhibitors US Patent US10266513 Publication Date 4/23/2019
 
Tyrosine-protein kinase BTK
Name:Tyrosine-protein kinase BTK
Type:Enzyme
Mol. Mass.:76289.95
Organism:Homo sapiens (Human)
Description:Q06187
Residue:659
BDBM377780
NameBDBM377780
Synonyms:5-amino-1-(1-cyanopiperidn-3-yl)-3-[4-(2-fluorobenzyl)phenyl]-1H-pyrazole-4-carboxamide US10266513, Example 76 | US10815213, Example 76
TypeSmall organic molecule
Emp. Form.C23H23FN6O
Mol. Mass.418.4667
SMILESNC(=O)c1c(N)n(nc1-c1ccc(Cc2ccccc2F)cc1)C1CCCN(C1)C#N