Reaction Details
TargetPotassium voltage-gated channel subfamily H member 2
LigandBDBM24223
Substrate/CompetitorBDBM24226
Meas. Tech.[3H]Astemizole Binding Assay
pH7.4±n/a
Temperature295.15±n/a K
IC50 2000±n/a nM
Citation Grice, CATays, KLSavall, BMWei, JButler, CRAxe, FUBembenek, SDFourie, AMDunford, PJLundeen, KColes, FXue, XRiley, JPWilliams, KNKarlsson, LEdwards, JP Identification of a potent, selective, and orally active leukotriene a4 hydrolase inhibitor with anti-inflammatory activity. J Med Chem51:4150-69 (2008) 
 
Potassium voltage-gated channel subfamily H member 2
Name:Potassium voltage-gated channel subfamily H member 2
Type:Multi-pass membrane protein
Mol. Mass.:126672.65
Organism:Homo sapiens (Human)
Description:Q12809
Residue:1159
BDBM24223
BDBM24226
NameBDBM24223
Synonyms:2-{4-[2-(piperidin-1-yl)ethyl]phenoxy}-1,3-benzothiazole | Benzthiazole compound, 27b
TypeSmall organic molecule
Emp. Form.C20H22N2OS
Mol. Mass.338.466
SMILESC(Cc1ccc(Oc2nc3ccccc3s2)cc1)N1CCCCC1