Reaction Details
TargetPotassium voltage-gated channel subfamily H member 2
LigandBDBM24228
Substrate/CompetitorBDBM24226
Meas. Tech.[3H]Astemizole Binding Assay
IC50 500±n/a nM
Citation Grice, CATays, KLSavall, BMWei, JButler, CRAxe, FUBembenek, SDFourie, AMDunford, PJLundeen, KColes, FXue, XRiley, JPWilliams, KNKarlsson, LEdwards, JP Identification of a potent, selective, and orally active leukotriene a4 hydrolase inhibitor with anti-inflammatory activity. J Med Chem51:4150-69 (2008) 
 
Potassium voltage-gated channel subfamily H member 2
Name:Potassium voltage-gated channel subfamily H member 2
Type:Multi-pass membrane protein
Mol. Mass.:126672.65
Organism:Homo sapiens (Human)
Description:Q12809
Residue:1159
BDBM24228
BDBM24226
NameBDBM24228
Synonyms:3-(1-{2-[4-(1,3-benzothiazol-2-yloxy)phenyl]ethyl}piperidin-4-yl)-1,3-oxazolidin-2-one | Benzthiazole compound, 27l
TypeSmall organic molecule
Emp. Form.C23H25N3O3S
Mol. Mass.423.528
SMILESO=C1OCCN1C1CCN(CCc2ccc(Oc3nc4ccccc4s3)cc2)CC1