Reaction Details
TargetPotassium voltage-gated channel subfamily H member 2
LigandBDBM24231
Substrate/CompetitorBDBM24226
Meas. Tech.[3H]Astemizole Binding Assay
IC50>30000±n/a nM
Citation Grice, CATays, KLSavall, BMWei, JButler, CRAxe, FUBembenek, SDFourie, AMDunford, PJLundeen, KColes, FXue, XRiley, JPWilliams, KNKarlsson, LEdwards, JP Identification of a potent, selective, and orally active leukotriene a4 hydrolase inhibitor with anti-inflammatory activity. J Med Chem51:4150-69 (2008) 
 
Potassium voltage-gated channel subfamily H member 2
Name:Potassium voltage-gated channel subfamily H member 2
Type:Multi-pass membrane protein
Mol. Mass.:126672.65
Organism:Homo sapiens (Human)
Description:Q12809
Residue:1159
BDBM24231
BDBM24226
NameBDBM24231
Synonyms:2-[4-(piperidin-1-ylmethyl)phenoxy]-1,3-benzothiazole | Benzthiazole compound, 33b
TypeSmall organic molecule
Emp. Form.C19H20N2OS
Mol. Mass.324.44
SMILESC(N1CCCCC1)c1ccc(Oc2nc3ccccc3s2)cc1