Reaction Details
TargetPotassium voltage-gated channel subfamily H member 2
LigandBDBM24233
Substrate/CompetitorBDBM24226
Meas. Tech.[3H]Astemizole Binding Assay
IC50>30000±n/a nM
Citation Grice, CATays, KLSavall, BMWei, JButler, CRAxe, FUBembenek, SDFourie, AMDunford, PJLundeen, KColes, FXue, XRiley, JPWilliams, KNKarlsson, LEdwards, JP Identification of a potent, selective, and orally active leukotriene a4 hydrolase inhibitor with anti-inflammatory activity. J Med Chem51:4150-69 (2008) 
 
Potassium voltage-gated channel subfamily H member 2
Name:Potassium voltage-gated channel subfamily H member 2
Type:Multi-pass membrane protein
Mol. Mass.:126672.65
Organism:Homo sapiens (Human)
Description:Q12809
Residue:1159
BDBM24233
BDBM24226
NameBDBM24233
Synonyms:1-{[4-(1,3-benzothiazol-2-yloxy)phenyl]methyl}piperidine-4-carboxamide | Benzthiazole compound, 33h
TypeSmall organic molecule
Emp. Form.C20H21N3O2S
Mol. Mass.367.465
SMILESNC(=O)C1CCN(Cc2ccc(Oc3nc4ccccc4s3)cc2)CC1