Reaction Details
TargetPotassium voltage-gated channel subfamily H member 2
LigandBDBM24237
Substrate/CompetitorBDBM24226
Meas. Tech.[3H]Astemizole Binding Assay
IC50 30000±n/a nM
Citation Grice, CATays, KLSavall, BMWei, JButler, CRAxe, FUBembenek, SDFourie, AMDunford, PJLundeen, KColes, FXue, XRiley, JPWilliams, KNKarlsson, LEdwards, JP Identification of a potent, selective, and orally active leukotriene a4 hydrolase inhibitor with anti-inflammatory activity. J Med Chem51:4150-69 (2008) 
 
Potassium voltage-gated channel subfamily H member 2
Name:Potassium voltage-gated channel subfamily H member 2
Type:Multi-pass membrane protein
Mol. Mass.:126672.65
Organism:Homo sapiens (Human)
Description:Q12809
Residue:1159
BDBM24237
BDBM24226
NameBDBM24237
Synonyms:Benzthiazole compound, 33o | [(1-{[4-(1,3-benzothiazol-2-yloxy)phenyl]methyl}piperidin-4-yl)carbamoyl]methyl acetate
TypeSmall organic molecule
Emp. Form.C23H25N3O4S
Mol. Mass.439.527
SMILESCC(=O)OCC(=O)NC1CCN(Cc2ccc(Oc3nc4ccccc4s3)cc2)CC1