Reaction Details
TargetPotassium voltage-gated channel subfamily H member 2
LigandBDBM24238
Substrate/CompetitorBDBM24226
Meas. Tech.[3H]Astemizole Binding Assay
IC50>16000±n/a nM
Citation Grice, CATays, KLSavall, BMWei, JButler, CRAxe, FUBembenek, SDFourie, AMDunford, PJLundeen, KColes, FXue, XRiley, JPWilliams, KNKarlsson, LEdwards, JP Identification of a potent, selective, and orally active leukotriene a4 hydrolase inhibitor with anti-inflammatory activity. J Med Chem51:4150-69 (2008) 
 
Potassium voltage-gated channel subfamily H member 2
Name:Potassium voltage-gated channel subfamily H member 2
Type:Multi-pass membrane protein
Mol. Mass.:126672.65
Organism:Homo sapiens (Human)
Description:Q12809
Residue:1159
BDBM24238
BDBM24226
NameBDBM24238
Synonyms:Benzthiazole compound, 33p | N-(1-{[4-(1,3-benzothiazol-2-yloxy)phenyl]methyl}piperidin-4-yl)-2-hydroxyacetamide
TypeSmall organic molecule
Emp. Form.C21H23N3O3S
Mol. Mass.397.491
SMILESOCC(=O)NC1CCN(Cc2ccc(Oc3nc4ccccc4s3)cc2)CC1