Reaction Details
TargetPhosphatidylinositol 4,5-bisphosphate 3-kinase catalytic subunit gamma isoform
LigandBDBM25028
Substrate/CompetitorBDBM15235
Meas. Tech.Scintillation Proximity Assay
pH7.5±n/a
Temperature295.15±n/a K
IC50 75±n/a nM
Citation Folkes, AJAhmadi, KAlderton, WKAlix, SBaker, SJBox, GChuckowree, ISClarke, PADepledge, PEccles, SAFriedman, LSHayes, AHancox, TCKugendradas, ALensun, LMoore, POlivero, AGPang, JPatel, SPergl-Wilson, GHRaynaud, FIRobson, ASaghir, NSalphati, LSohal, SUltsch, MHValenti, MWallweber, HJWan, NCWiesmann, CWorkman, PZhyvoloup, AZvelebil, MJShuttleworth, SJ The identification of 2-(1H-indazol-4-yl)-6-(4-methanesulfonyl-piperazin-1-ylmethyl)-4-morpholin-4-yl-thieno[3,2-d]pyrimidine (GDC-0941) as a potent, selective, orally bioavailable inhibitor of class I PI3 kinase for the treatment of cancer . J Med Chem51:5522-32 (2008) 
 
Phosphatidylinositol 4,5-bisphosphate 3-kinase catalytic subunit gamma isoform
Name:Phosphatidylinositol 4,5-bisphosphate 3-kinase catalytic subunit gamma isoform
Type:Enzyme Subunit
Mol. Mass.:126470.30
Organism:Homo sapiens (Human)
Description:P48736
Residue:1102
BDBM25028
BDBM15235
NameBDBM25028
Synonyms:4-[2-(1H-indazol-4-yl)-6-[(4-methanesulfonylpiperazin-1-yl)methyl]thieno[3,2-d]pyrimidin-4-yl]morpholine GDC0941 US10851091, Compound pictilisib
TypeSmall organic molecule
Emp. Form.C23H27N7O3S2
Mol. Mass.513.636
SMILESCS(=O)(=O)N1CCN(Cc2cc3nc(nc(N4CCOCC4)c3s2)-c2cccc3[nH]ncc23)CC1