Reaction Details
TargetHistamine H3 receptor
LigandBDBM27193
Substrate/CompetitorBDBM22530
Meas. Tech.Radioligand Binding Assay
pH7.4±n/a
Temperature298.15±n/a K
Ki 5.37±n/a nM
Citation Zhao, CSun, MBennani, YLGopalakrishnan, SMWitte, DGMiller, TRKrueger, KMBrowman, KEThiffault, CWetter, JMarsh, KCHancock, AAEsbenshade, TACowart, MD The alkaloid conessine and analogues as potent histamine H3 receptor antagonists. J Med Chem51:5423-30 (2008) 
 
Histamine H3 receptor
Name:Histamine H3 receptor
Type:G Protein-Coupled Receptor (GPCR)
Mol. Mass.:48691.47
Organism:Homo sapiens (Human)
Description:Binding assays were using CHO cells stably expressing hH3R receptors.
Residue:445
BDBM27193
BDBM22530
NameBDBM27193
Synonyms:(1R,2S,5S,6S,9R,12S,13R,16S)-N,N,6,7,13-pentamethyl-7-azapentacyclo[10.8.0.0^{2,9}.0^{5,9}.0^{13,18}]icos-18-en-16-amine | Conessine
TypeAlkaloid
Emp. Form.C24H40N2
Mol. Mass.356.5878
SMILES[H][C@@]1(C)N(C)C[C@]23CC[C@@]4([H])[C@@]([H])(CC=C5C[C@H](CC[C@]45C)N(C)C)[C@]2([H])CC[C@]13[H]