Reaction Details
TargetPeroxisome proliferator-activated receptor alpha
LigandBDBM28803
Substrate/CompetitorBDBM28680
Meas. Tech.PPAR alpha Fluorescence Polarization Assay (IC50) and Cell-Based Transcription Assay (EC50)
pH8±n/a
Temperature295.15±n/a K
IC50>98400±n/a nM
EC50 11600±3100 nM
Comments104 +/- 8 efficacy.
Citation Mukherjee, RLocke, KTMiao, BMeyers, DMonshizadegan, HZhang, RSearch, DGrimm, DFlynn, MO'Malley, KMZhang, LLi, JShi, YKennedy, LJBlanar, MCheng, PTTino, JSrivastava, RA Novel peroxisome proliferator-activated receptor alpha agonists lower low-density lipoprotein and triglycerides, raise high-density lipoprotein, and synergistically increase cholesterol excretion with a liver X receptor agonist. J Pharmacol Exp Ther327:716-26 (2008) 
 
Peroxisome proliferator-activated receptor alpha
Name:Peroxisome proliferator-activated receptor alpha
Type:Enzyme
Mol. Mass.:52222.08
Organism:Homo sapiens (Human)
Description:Q07869
Residue:468
BDBM28803
BDBM28680
NameBDBM28803
Synonyms:2-[4-(4-chlorophenoxy)phenoxy]propanoic acid Fenofibric acid | HCG 004
TypeSmall organic molecule
Emp. Form.C15H13ClO4
Mol. Mass.292.714
SMILESCC(Oc1ccc(Oc2ccc(Cl)cc2)cc1)C(O)=O