Reaction Details
TargetPeroxisome proliferator-activated receptor alpha
LigandBDBM28802
Substrate/CompetitorBDBM10852
Meas. Tech.Cell-Based Transcription Assay
EC50 178±54 nM
Comments73 +/- 6 efficacy.
Citation Mukherjee, RLocke, KTMiao, BMeyers, DMonshizadegan, HZhang, RSearch, DGrimm, DFlynn, MO'Malley, KMZhang, LLi, JShi, YKennedy, LJBlanar, MCheng, PTTino, JSrivastava, RA Novel peroxisome proliferator-activated receptor alpha agonists lower low-density lipoprotein and triglycerides, raise high-density lipoprotein, and synergistically increase cholesterol excretion with a liver X receptor agonist. J Pharmacol Exp Ther327:716-26 (2008) 
 
Peroxisome proliferator-activated receptor alpha
Name:Peroxisome proliferator-activated receptor alpha
Synonyms:Peroxisome proliferator activated receptor alpha
Type:Nuclear hormone receptor
Mol. Mass.:52425.32
Organism:Mesocricetus auratus (golden hamster)
Description:Q7TNH1
Residue:468
BDBM28802
BDBM10852
NameBDBM28802
TypeSmall organic molecule
Emp. Form.C22H20ClFN2O6
Mol. Mass.462.855
SMILESCOC(=O)N(CC(O)=O)Cc1cc(OCc2nc(oc2C)-c2ccc(Cl)cc2)ccc1F