Reaction Details
TargetPeroxisome proliferator-activated receptor alpha
LigandBDBM28802
Substrate/CompetitorBDBM10852
Meas. Tech.Cell-Based Transcription Assay
EC50 145±55 nM
Comments83 +/- 21 efficacy.
Citation Mukherjee, RLocke, KTMiao, BMeyers, DMonshizadegan, HZhang, RSearch, DGrimm, DFlynn, MO'Malley, KMZhang, LLi, JShi, YKennedy, LJBlanar, MCheng, PTTino, JSrivastava, RA Novel peroxisome proliferator-activated receptor alpha agonists lower low-density lipoprotein and triglycerides, raise high-density lipoprotein, and synergistically increase cholesterol excretion with a liver X receptor agonist. J Pharmacol Exp Ther327:716-26 (2008) 
 
Peroxisome proliferator-activated receptor alpha
Name:Peroxisome proliferator-activated receptor alpha
Type:PROTEIN
Mol. Mass.:52343.28
Organism:Mus musculus
Description:ChEMBL_572395
Residue:468
BDBM28802
BDBM10852
NameBDBM28802
Synonyms:2-{[(5-{[2-(4-chlorophenyl)-5-methyl-1,3-oxazol-4-yl]methoxy}-2-fluorophenyl)methyl](methoxycarbonyl)amino}acetic acid | BMS-711939
TypeSmall organic molecule
Emp. Form.C22H20ClFN2O6
Mol. Mass.462.855
SMILESCOC(=O)N(CC(O)=O)Cc1cc(OCc2nc(oc2C)-c2ccc(Cl)cc2)ccc1F