Reaction Details
TargetPeroxisome proliferator-activated receptor alpha
LigandBDBM28803
Substrate/CompetitorBDBM10852
Meas. Tech.Cell-Based Transcription Assay
EC50 17700±5400 nM
Comments87 +/- 14 efficacy.
Citation Mukherjee, RLocke, KTMiao, BMeyers, DMonshizadegan, HZhang, RSearch, DGrimm, DFlynn, MO'Malley, KMZhang, LLi, JShi, YKennedy, LJBlanar, MCheng, PTTino, JSrivastava, RA Novel peroxisome proliferator-activated receptor alpha agonists lower low-density lipoprotein and triglycerides, raise high-density lipoprotein, and synergistically increase cholesterol excretion with a liver X receptor agonist. J Pharmacol Exp Ther327:716-26 (2008) 
 
Peroxisome proliferator-activated receptor alpha
Name:Peroxisome proliferator-activated receptor alpha
Type:PROTEIN
Mol. Mass.:52374.28
Organism:Rattus norvegicus
Description:ChEMBL_834194
Residue:468
BDBM28803
BDBM10852
NameBDBM28803
Synonyms:2-[4-(4-chlorophenoxy)phenoxy]propanoic acid Fenofibric acid | HCG 004
TypeSmall organic molecule
Emp. Form.C15H13ClO4
Mol. Mass.292.714
SMILESCC(Oc1ccc(Oc2ccc(Cl)cc2)cc1)C(O)=O