Reaction Details
TargetCannabinoid receptor 2
LigandBDBM29097
Substrate/CompetitorBDBM21278
Meas. Tech.CB Receptor Radioligand Binding Assay (Ki)
pH7.2±n/a
Temperature295.15±n/a K
Ki 1259±n/a nM
Citation Pettersson, HBülow, AEk, FJensen, JOttesen, LKFejzic, AMa, JNDel Tredici, ALCurrier, EAGardell, LRTabatabaei, ACraig, DMcFarland, KOtt, TRPiu, FBurstein, ESOlsson, R Synthesis and evaluation of dibenzothiazepines: a novel class of selective cannabinoid-1 receptor inverse agonists. J Med Chem52:1975-82 (2009) 
 
Cannabinoid receptor 2
Name:Cannabinoid receptor 2
Type:G Protein-Coupled Receptor (GPCR)
Mol. Mass.:39690.94
Organism:Homo sapiens (Human)
Description:P34972
Residue:360
BDBM29097
BDBM21278
NameBDBM29097
Synonyms:dibenzothiazepine, 12c
TypeSmall organic molecule
Emp. Form.C26H22ClF2N3OS
Mol. Mass.497.987
SMILESFC1(F)CCN(CC1)C1=Nc2cc(ccc2Sc2ccccc12)C(=O)NCc1cccc(Cl)c1