Reaction Details
TargetCannabinoid receptor 2
LigandBDBM29099
Substrate/CompetitorBDBM21278
Meas. Tech.CB Receptor Radioligand Binding Assay (Ki)
pH7.2±n/a
Temperature295.15±n/a K
Ki 5012±n/a nM
Citation Pettersson, HBülow, AEk, FJensen, JOttesen, LKFejzic, AMa, JNDel Tredici, ALCurrier, EAGardell, LRTabatabaei, ACraig, DMcFarland, KOtt, TRPiu, FBurstein, ESOlsson, R Synthesis and evaluation of dibenzothiazepines: a novel class of selective cannabinoid-1 receptor inverse agonists. J Med Chem52:1975-82 (2009) 
 
Cannabinoid receptor 2
Name:Cannabinoid receptor 2
Type:G Protein-Coupled Receptor (GPCR)
Mol. Mass.:39690.94
Organism:Homo sapiens (Human)
Description:P34972
Residue:360
BDBM29099
BDBM21278
NameBDBM29099
Synonyms:dibenzothiazepine, 12g
TypeSmall organic molecule
Emp. Form.C24H21ClN2OS
Mol. Mass.420.954
SMILESCCCCNC(=O)c1ccc2Sc3ccccc3C(=Nc2c1)c1ccccc1Cl