Reaction Details
TargetAndrogen receptor
LigandBDBM18173
Substrate/CompetitorBDBM18161
Meas. Tech.Receptor Binding Assay (Ki) and Transactivation Assay (EC50)
pH7.6±n/a
Temperature295.15±n/a K
Ki 14±3 nM
EC50 7.8±2 nM
Citation Nirschl, AAZou, YKrystek, SRSutton, JCSimpkins, LMLupisella, JAKuhns, JESeethala, RGolla, RSleph, PGBeehler, BCGrover, GJEgan, DFura, AVyas, VPLi, YXSack, JSKish, KFAn, YBryson, JAGougoutas, JZDiMarco, JZahler, ROstrowski, JHamann, LG N-aryl-oxazolidin-2-imine muscle selective androgen receptor modulators enhance potency through pharmacophore reorientation. J Med Chem52:2794-8 (2009) 
 
Androgen receptor
Name:Androgen receptor
Type:Receptor
Mol. Mass.:99185.27
Organism:Homo sapiens (Human)
Description:CHO cells were stably transfected with human AR gene.
Residue:920
BDBM18173
BDBM18161
NameBDBM18173
Synonyms:4-[(7R,7aS)-7-hydroxy-1,3-dioxo-hexahydro-1H-pyrrolo[1,2-a]imidazolidin-2-yl]-2-chloro-3-methylbenzonitrile CHEMBL229264
TypeSmall organic molecule
Emp. Form.C14H12ClN3O3
Mol. Mass.305.716
SMILESCc1c(Cl)c(ccc1-n1c(O)c2[C@H](O)CCn2c1=O)C#N