Reaction Details
TargetSterol 14-alpha demethylase
LigandBDBM25810
Substrate/CompetitorBDBM10852
Meas. Tech.Spectral Titration of TCCYP51
pH7.4±n/a
Temperature297.15±n/a K
Kd 440±20 nM
Citation Konkle, MEHargrove, TYKleshchenko, YYvon Kries, JPRidenour, WUddin, MJCaprioli, RMMarnett, LJNes, WDVillalta, FWaterman, MRLepesheva, GI Indomethacin amides as a novel molecular scaffold for targeting Trypanosoma cruzi sterol 14alpha-demethylase. J Med Chem52:2846-53 (2009) 
 
Sterol 14-alpha demethylase
Name:Sterol 14-alpha demethylase
Type:Protein
Mol. Mass.:54690.12
Organism:Trypanosoma cruzi
Description:Q7Z1V1
Residue:481
BDBM25810
BDBM10852
NameBDBM25810
Synonyms:2-phenyl-N-(pyridin-4-yl)butanamide Compound 3937-0152 (EPBA) | JMC522846 Compound 5
TypeSmall organic molecule
Emp. Form.C15H16N2O
Mol. Mass.240.3003
SMILESCCC(C(=O)Nc1ccncc1)c1ccccc1