Reaction Details
TargetSterol 14-alpha demethylase
LigandBDBM29351
Substrate/CompetitorBDBM10852
Meas. Tech.Spectral Titration of TCCYP51
pH7.4±n/a
Temperature297.15±n/a K
Kd 150±10 nM
Citation Konkle, MEHargrove, TYKleshchenko, YYvon Kries, JPRidenour, WUddin, MJCaprioli, RMMarnett, LJNes, WDVillalta, FWaterman, MRLepesheva, GI Indomethacin amides as a novel molecular scaffold for targeting Trypanosoma cruzi sterol 14alpha-demethylase. J Med Chem52:2846-53 (2009) 
 
Sterol 14-alpha demethylase
Name:Sterol 14-alpha demethylase
Type:Protein
Mol. Mass.:54690.12
Organism:Trypanosoma cruzi
Description:Q7Z1V1
Residue:481
BDBM29351
BDBM10852
NameBDBM29351
Synonyms:Indomethacin-amide derivative, 22
TypeSmall organic molecule
Emp. Form.C28H27ClN2O3
Mol. Mass.474.979
SMILESCOc1ccc2n(C(=O)c3ccc(Cl)cc3)c(C)c(CC(=O)NCC(C)c3ccccc3)c2c1