Reaction Details
TargetD-amino-acid oxidase
LigandBDBM31148
Substrate/CompetitorBDBM23167
Meas. Tech.DAAO in Vitro Activity Assay
IC50 215±n/a nM
Citation Duplantier, AJBecker, SLBohanon, MJBorzilleri, KAChrunyk, BADowns, JTHu, LYEl-Kattan, AJames, LCLiu, SLu, JMaklad, NMansour, MNMente, SPiotrowski, MASakya, SMSheehan, SSteyn, SJStrick, CAWilliams, VAZhang, L Discovery, SAR, and pharmacokinetics of a novel 3-hydroxyquinolin-2(1H)-one series of potent D-amino acid oxidase (DAAO) inhibitors. J Med Chem52:3576-85 (2009) 
 
D-amino-acid oxidase
Name:D-amino-acid oxidase
Type:Homodimer
Mol. Mass.:38824.91
Organism:Rattus norvegicus (rat)
Description:Recombinant rat DAAO expressed and purified from sf9 insect cells, was used in enzyme assays.
Residue:346
BDBM31148
BDBM23167
NameBDBM31148
Synonyms:3-hydroxyquinolin-2(1H)-one, 2 | US9701638, 1
TypeSmall organic molecule
Emp. Form.C9H7NO2
Mol. Mass.161.1574
SMILESOc1cc2ccccc2[nH]c1=O