Reaction Details
TargetD-amino-acid oxidase
LigandBDBM31161
Substrate/CompetitorBDBM23167
Meas. Tech.DAAO in Vitro Activity Assay
IC50 3665±n/a nM
Citation Duplantier, AJBecker, SLBohanon, MJBorzilleri, KAChrunyk, BADowns, JTHu, LYEl-Kattan, AJames, LCLiu, SLu, JMaklad, NMansour, MNMente, SPiotrowski, MASakya, SMSheehan, SSteyn, SJStrick, CAWilliams, VAZhang, L Discovery, SAR, and pharmacokinetics of a novel 3-hydroxyquinolin-2(1H)-one series of potent D-amino acid oxidase (DAAO) inhibitors. J Med Chem52:3576-85 (2009) 
 
D-amino-acid oxidase
Name:D-amino-acid oxidase
Type:Homodimer
Mol. Mass.:38824.91
Organism:Rattus norvegicus (rat)
Description:Recombinant rat DAAO expressed and purified from sf9 insect cells, was used in enzyme assays.
Residue:346
BDBM31161
BDBM23167
NameBDBM31161
Synonyms:3-hydroxyquinolin-2(1H)-one, 15
TypeSmall organic molecule
Emp. Form.C11H11NO2
Mol. Mass.189.2105
SMILESCCc1cccc2[nH]c(=O)c(O)cc12