Reaction Details
TargetCoagulation factor X
LigandBDBM81698
Substrate/Competitorn/a
Meas. Tech.Inhibition Assay
IC50 1.0±0.0 nM
Citation Van Huis, CABigge, CFCasimiro-Garcia, ACody, WLDudley, DAFilipski, KJHeemstra, RJKohrt, JTNarasimhan, LSSchaum, RPZhang, EBryant, JWHaarer, SJaniczek, NLeadley, RJMcClanahan, TThomas Peterson, JWelch, KMEdmunds, JJ Structure-based drug design of pyrrolidine-1, 2-dicarboxamides as a novel series of orally bioavailable factor Xa inhibitors. Chem Biol Drug Des69:444-50 (2007) 
 
Coagulation factor X
Name:Coagulation factor X
Type:Enzyme
Mol. Mass.:54726.60
Organism:Homo sapiens (Human)
Description:n/a
Residue:488
BDBM81698
NameBDBM81698
Synonyms:4-Substituted Pyrrolidine Ring, 35
TypeSmall organic molecule
Emp. Form.C25H24ClFN4O5S
Mol. Mass.546.998
SMILESCOC1C[C@@H](N(C1)C(=O)Nc1ccc(Cl)cn1)C(=O)Nc1ccc(cc1F)-c1ccccc1S(C)(=O)=O