Reaction Details
TargetD(2) dopamine receptor
LigandBDBM50094670
Substrate/Competitorn/a
Ki 1000±n/a nM
CommentsPDSP_1142
Citation Foreman, MMFuller, RWRasmussen, KNelson, DLCalligaro, DOZhang, LBarrett, JEBooher, RNPaget, CJFlaugh, ME Pharmacological characterization of LY293284: A 5-HT1A receptor agonist with high potency and selectivity. J Pharmacol Exp Ther270:1270-81 (1994) D(2) dopamine receptor
Name:D(2) dopamine receptor
Type:G Protein-Coupled Receptor (GPCR)
Mol. Mass.:50931.60
Organism:Rattus norvegicus (rat)
Description:P61169
Residue:444
BDBM50094670
NameBDBM50094670
Synonyms:1-(4-Dipropylamino-1,3,4,5-tetrahydro-benzo[cd]indol-6-yl)-ethanone LY 293284 LY-293384
TypeSmall organic molecule
Emp. Form.C19H26N2O
Mol. Mass.298.4225
SMILESCCCN(CCC)C1Cc2c[nH]c3ccc(C(C)=O)c(C1)c23