Reaction Details
TargetCoagulation factor IX
LigandBDBM50240471
Substrate/Competitorn/a
Meas. Tech.ChEMBL_1668200 (CHEMBL4018088)
IC50 15±n/a nM
Citation Sakurada, IEndo, THikita, KHirabayashi, THosaka, YKato, YMaeda, YMatsumoto, SMizuno, TNagasue, HNishimura, TShimada, SShinozaki, MTaguchi, KTakeuchi, KYokoyama, THruza, AReichert, PZhang, TWood, HBNakao, KFurusako, S Discovery of novel aminobenzisoxazole derivatives as orally available factor IXa inhibitors. Bioorg Med Chem Lett27:2622-2628 (2017) 
 
Coagulation factor IX
Name:Coagulation factor IX
Type:Enzyme
Mol. Mass.:51768.83
Organism:Homo sapiens (Human)
Description:P00740
Residue:461
BDBM50240471
NameBDBM50240471
Synonyms:CHEMBL4069082 | US9969724, Example 45
TypeSmall organic molecule
Emp. Form.C20H18Cl2N8O3
Mol. Mass.489.315
SMILESCn1ncn(-c2ccc(C(=O)N[C@@H]3CCN(C3)c3ncc(Cl)c4c(N)noc34)c(Cl)c2)c1=O