Reaction Details
TargetCoagulation factor IX
LigandBDBM50240479
Substrate/Competitorn/a
Meas. Tech.ChEMBL_1668200 (CHEMBL4018088)
IC50 47±n/a nM
Citation Sakurada, IEndo, THikita, KHirabayashi, THosaka, YKato, YMaeda, YMatsumoto, SMizuno, TNagasue, HNishimura, TShimada, SShinozaki, MTaguchi, KTakeuchi, KYokoyama, THruza, AReichert, PZhang, TWood, HBNakao, KFurusako, S Discovery of novel aminobenzisoxazole derivatives as orally available factor IXa inhibitors. Bioorg Med Chem Lett27:2622-2628 (2017) 
 
Coagulation factor IX
Name:Coagulation factor IX
Type:Enzyme
Mol. Mass.:51768.83
Organism:Homo sapiens (Human)
Description:P00740
Residue:461
BDBM50240479
NameBDBM50240479
Synonyms:CHEMBL4072364 | US9969724, Example 14
TypeSmall organic molecule
Emp. Form.C20H16Cl3N7O2
Mol. Mass.492.746
SMILESNc1noc2c(cc(Cl)c(Cl)c12)N1CC[C@H](C1)NC(=O)c1ccc(cc1Cl)-n1cnnc1