Reaction Details
TargetDual specificity tyrosine-phosphorylation-regulated kinase 1A
LigandBDBM50242621
Substrate/Competitorn/a
Meas. Tech.ChEMBL_1671986 (CHEMBL4022015)
IC50<10000±n/a nM
Citation Karthikeyan, CJharia, PWaiker, DKNusbaum, ACAmawi, HKirwen, EMChristman, RArudra, SKCMeijer, LTiwari, AKTrivedi, P N-(1H-Pyrazol-3-yl)quinazolin-4-amines as a novel class of casein kinase 1?/? inhibitors: Synthesis, biological evaluation and molecular modeling studies. Bioorg Med Chem Lett27:2663-2667 (2017) 
 
Dual specificity tyrosine-phosphorylation-regulated kinase 1A
Name:Dual specificity tyrosine-phosphorylation-regulated kinase 1A
Type:Enzyme
Mol. Mass.:85616.61
Organism:Homo sapiens (Human)
Description:Q13627
Residue:763
BDBM50242621
NameBDBM50242621
Synonyms:CHEMBL4070204
TypeSmall organic molecule
Emp. Form.C13H13N5O3
Mol. Mass.287.274
SMILESCOc1cc2ncnc(Nc3cc(O)[nH]n3)c2cc1OC