Reaction Details
TargetDual specificity protein kinase CLK1
LigandBDBM50242618
Substrate/Competitorn/a
Meas. Tech.ChEMBL_1671985 (CHEMBL4022014)
IC50<10000±n/a nM
Citation Karthikeyan, CJharia, PWaiker, DKNusbaum, ACAmawi, HKirwen, EMChristman, RArudra, SKCMeijer, LTiwari, AKTrivedi, P N-(1H-Pyrazol-3-yl)quinazolin-4-amines as a novel class of casein kinase 1?/? inhibitors: Synthesis, biological evaluation and molecular modeling studies. Bioorg Med Chem Lett27:2663-2667 (2017) 
 
Dual specificity protein kinase CLK1
Name:Dual specificity protein kinase CLK1
Type:PROTEIN
Mol. Mass.:57124.52
Organism:Mus musculus
Description:ChEMBL_1502245
Residue:483
BDBM50242618
NameBDBM50242618
Synonyms:CHEMBL4099804
TypeSmall organic molecule
Emp. Form.C19H16ClN5O2
Mol. Mass.381.816
SMILESCOc1cc2ncnc(Nc3cc([nH]n3)-c3ccc(Cl)cc3)c2cc1OC