Reaction Details
TargetCyclin-dependent kinase 5 activator 1
LigandBDBM50242618
Substrate/Competitorn/a
Meas. Tech.ChEMBL_1671982 (CHEMBL4022011)
IC50<10000±n/a nM
Citation Karthikeyan, CJharia, PWaiker, DKNusbaum, ACAmawi, HKirwen, EMChristman, RArudra, SKCMeijer, LTiwari, AKTrivedi, P N-(1H-Pyrazol-3-yl)quinazolin-4-amines as a novel class of casein kinase 1?/? inhibitors: Synthesis, biological evaluation and molecular modeling studies. Bioorg Med Chem Lett27:2663-2667 (2017) 
 
Cyclin-dependent kinase 5 activator 1
Name:Cyclin-dependent kinase 5 activator 1
Type:Protein Complex
Mol. Mass.:n/a
Description:n/a
Components:This complex has 2 components.
Component 1
Name:Cyclin-dependent kinase 5
Synonyms:CDK5 CDKN5 Cyclin-dependent kinase 5 (CDK5/ p25) Cyclin-dependent-like kinase 5 PSSALRE Tau protein kinase II catalytic subunit
Type:Enzyme Subunit
Mol. Mass.:33308.61
Organism:Homo sapiens (Human)
Description:n/a
Residue:292
Component 2
Name:Cyclin-dependent kinase 5 activator 1
Synonyms:CD5R1_HUMAN CDK5R1 Cyclin-dependent kinase 5 (CDK5/p25) NCK5A p35
Type:Enzyme Subunit
Mol. Mass.:34077.43
Organism:Homo sapiens (Human)
Description:Q15078
Residue:307
BDBM50242618
NameBDBM50242618
Synonyms:CHEMBL4099804
TypeSmall organic molecule
Emp. Form.C19H16ClN5O2
Mol. Mass.381.816
SMILESCOc1cc2ncnc(Nc3cc([nH]n3)-c3ccc(Cl)cc3)c2cc1OC