Reaction Details
TargetCyclin-A2/Cyclin-dependent kinase 2
LigandBDBM50242622
Substrate/Competitorn/a
Meas. Tech.ChEMBL_1671981 (CHEMBL4022010)
IC50<10000±n/a nM
Citation Karthikeyan, CJharia, PWaiker, DKNusbaum, ACAmawi, HKirwen, EMChristman, RArudra, SKCMeijer, LTiwari, AKTrivedi, P N-(1H-Pyrazol-3-yl)quinazolin-4-amines as a novel class of casein kinase 1?/? inhibitors: Synthesis, biological evaluation and molecular modeling studies. Bioorg Med Chem Lett27:2663-2667 (2017) 
 
Cyclin-A2/Cyclin-dependent kinase 2
Name:Cyclin-A2/Cyclin-dependent kinase 2
Type:Protein Complex
Mol. Mass.:n/a
Description:Cdk2/Cyclin A kinase was purified from insect cells coinfected with Cyclin A/Cdk2 baculovirus.
Components:This complex has 2 components.
Component 1
Name:Cyclin-dependent kinase 2
Synonyms:CDK2 CDK2_HUMAN Cell division protein kinase 2 Protein cereblon/Cyclin-dependent kinase 2 | p33 protein kinase
Type:Enzyme Subunit
Mol. Mass.:33938.17
Organism:Homo sapiens (Human)
Description:P24941
Residue:298
Component 2
Name:Cyclin-A2
Synonyms:CCN1 CCNA1 CCNA2_HUMAN Cyclin-A
Type:Enzyme Subunit
Mol. Mass.:48550.19
Organism:Homo sapiens (Human)
Description:P20248
Residue:432
BDBM50242622
NameBDBM50242622
Synonyms:CHEMBL4065204
TypeSmall organic molecule
Emp. Form.C25H21N5O2
Mol. Mass.423.4665
SMILESCOc1cc2ncnc(Nc3cc(-c4ccccc4)n(n3)-c3ccccc3)c2cc1OC