Reaction Details
TargetInterleukin-1 receptor-associated kinase 4
LigandBDBM50242701
Substrate/Competitorn/a
Meas. Tech.ChEMBL_1672106 (CHEMBL4022135)
IC50 15±n/a nM
Citation Smith, GFAltman, MDAndresen, BBaker, JBrubaker, JDChen, HChen, YChilders, MDonofrio, AFerguson, HFischer, CFischmann, TOGibeau, CHicks, AJin, SKattar, SKleinschek, MALeccese, ELesburg, CLi, CLim, JLiu, DMaclean, JKFMansoor, FMoy, LYMulrooney, EFNecheva, ASPresland, JRakhilina, LYang, RTorres, LZhang-Hoover, JNorthrup, A Identification of quinazoline based inhibitors of IRAK4 for the treatment of inflammation. Bioorg Med Chem Lett27:2721-2726 (2017) 
 
Interleukin-1 receptor-associated kinase 4
Name:Interleukin-1 receptor-associated kinase 4
Type:Protein
Mol. Mass.:51519.08
Organism:Homo sapiens (Human)
Description:Q9NWZ3
Residue:460
BDBM50242701
NameBDBM50242701
Synonyms:CHEMBL4059675 | US9932350, 3-44
TypeSmall organic molecule
Emp. Form.C19H23N5
Mol. Mass.321.4194
SMILESN#Cc1ccc2ncnc(N[C@H]3CC[C@@H](CC3)N3CCCC3)c2c1